Failed to resolve unit specifiers

failed to resolve unit specifiers -60 License server system message checksum failure. 9 Jan 2019 Failed to resolve unit specifiers on 100%VG: Invalid slot #1525. Share. A module must be either a full URL (including a protocol), an absolute path (starting with /), or a relative path (starting with . The current format_date() function does several things - adjust for timezone, apply default formats, and translate the results of date formats. 260 into android-4. Metro Inverness turned control of the Vallagio at Invernesss Residential Condominium Association over to the condominium’s unit owners in 2010, and in 2012 the last unit was sold by the developer. To correct this error, verify that the file is not in use by another application and that file permissions are set correctly. 784-2146893564 JDK 1. See systemd. :stas suggests that for now, we limit the syntax to this, and leave the door open to explore supporting more complex accessors (for values with multiple Oct 17, 2016 · Revised to allow for unit load devices (ULD) that contain UN 3373 or ID 8000 to also contain dry ice as a refrigerant. How come? I'm using systemd 215-17 on Debian Jessie. + Aim to submit by end of the year - Unit Ontology + We need to add some terms for mass spec and send to maintainer + We need to change some funny characters in there that are causing our software some problems + Maybe we can just fix the problem by converting unit. Using this, you can make the curl requests(s) use a specified address and prevent the otherwise normally resolved address to be used. 4. internal coreos-cloudinit[767]: 2018/04/11 21:53:14 Failed to apply cloud-config: Unit format-mnt-data. service:8: Failed to resolve unit specifiers on %f: Invalid argument ``` It happens when the instance name begins with `/` character which causes this error when used specifier `%f`. NumberFormatException ? NumberFormatException is thrown by many constructors/methods in the classes of java. target nss-lookup. 0. com. Previously, restarting the stub after the queue manager was brought back online would result in the stub immediately failing and ending. Hello all, I am having a hard time getting this to work. socket Note for the record: that commit was made *after* I filed the bug :) *** This bug has been marked as a duplicate of bug 1526861 *** Apr 19, 2016 · Apr 19 23:17:14 centos-aiman systemd[1]: Failed to start OpenVPN Robust And Highly Flexible Tunneling Application On server. Open Source Software. In line with this, the DSM-5 includes a “peripartum onset” specifier, which can be used if mood disorder onset occurs during pregnancy or in the four weeks following delivery. In September 2013, the association (under the control of the unit owners) voted to amend the declaration for the project to remove Section 16. service failed because the control process exited with error code. S. com. Ex: "0", "1" type: string required: true name: "sender" # Coin account name for gas payer. I found FAST V8. ) /etc/systemd/system/jenkins-agent. No positions in optional float specifier. js`). For example, operations on an employee database (hire, fire, promote, lookup) could be coded as stored procedures executed by application code. celery. service:7: Failed to resolve unit specifiers on http://my. file and its auxiliary packages. fail() with more than one argument. -o output_file Specifies the name of a file that receives output redirected from the command prompt. . Number. Unit Testing UX ValueInjecter VB. ". When p4 resolve is run with no file arguments, it operates on all files in the client workspace that have been scheduled for resolve. Apr 11 21:53:14 ip-10-0-0-180. Because Added some infrastructure to resolve ClipboardItems into pasteboard data for writing; Added support for Clipboard. 26, a new version of the popular Open Source Database Management System, has been released. Sep 11, 2019 · Unit Tests: Feature: WEB-19963: Cucumber. xml: Bug: IDEA-122332: Repeated errors for missing Maven repo files: Performance: IDEA-209532 Feb 10, 2021 · The asymmetric unit is comprised to resolve L2 we attempted 3D classification of capsomers with and without symmetry expansion. /). iOS, Sample Code security · documentation · faq · books · support · trac · twitter · blog · unit · njs The function fails if max_size or bucket_size parameters are not big enough. Failed to resolve unit specifiers on Media check on %f, ignoring Solving failed units with systemctl Systemd is an alternative service manager to the more traditional init system. This queue manager is used for internal communication between the listener process and the message flow. service is not loaded properly: Exec format error. amazonaws. GREATER DETAIL ON THE ACTIONS I HAVE TAKEN TO RESOLVE THE COMPLAINT. If the last reading failed and the counters were not changed from their previous value, this value is set to false. 12 New provisions allow, with the approval of the authorities of the States of origin and of the operator, for the use of UN specification large packagings for articles that weigh in excess of 400 kg. Unit tests are your first line of defense against code bugs because, when done correctly, they test a single "unit" of code, typically a single function, and are easier to debug than your full program. service is not loaded properly: Exec format error. Accounting; CRM; Business Intelligence Feb 01, 2020 · JakeMerdichAMD added a comment to D80214: [clang-format] Set of unit test to begin to validate that we don't change defaults. There are multiple explanations that fall under the psychodynamic "umbrella" that explain why a person develops depressive symptoms. ) /etc/systemd/system/jenkins-agent. 02 Explain the functionality of a given iRule; Wrapping it up; Objective - 2. 7. Aug 16, 2007 · but I also have a second stored procedure that needs to make reference to this procedure first, in order to resolve an id - ie: exec dbo. unit man-page. fied incorrectly it often was because specifiers failed to take Here we describe extensions to P ROPEL that allow spec- into consideration some exceptional behavior of the system. NET 2012 VS. I've discovered that the systemd-fsck@ service failed too and this is the output of systemctl: Failed to resolve unit specifiers in 'File System Check on %f Jul 09 20:53:49 localhost systemd[1]: checkisomd5@-dev-sr0. Jul 10, 2019 · XtremeRain was founded by Hasibul Kabir back in 2014. . As a consequence, early-kdump and standard kdump both failed. PDF | On Nov 1, 1982, Ted R. FormatException: Format specifier was invalid. 0. Psychoanalysts historically believed that depression was caused by anger converted into self-hatred ("anger turned inward"). -61 Cannot read license file data from license server system. Post by welp » Tue Aug 21, 2018 11:48 am. Cluster unit unit-1-1 transitioned from DISABLED to MASTER New cluster member unit-2-1 rejected due to encryption license mismatch. A group can also be transformed as a unit. Hi! I have a question about systemjs (v0. To replace the waste you have to disconnect the waste unit from the chrome bottle trap. Jan 30, 2019 · Please consider a donation via PayPal to shardlow. service failed to run 'start' task: Operation not supported Failed to start Celery worker. /vue. . Response Use the information in the message to investigate the problem. </p><p></p><p>Full integration with Stryd. If the node is an ImportDeclaration , variables for all of its specifiers are returned. COM. New:Templatized TypeContainer implementation to allow for thread-safe objects; updated unit test New:Enabled user-defined suffixes on Saved folders with the -saveddirsuffix= command line parameter. If Myc mainly partitions unimodally between target sites, then at reduced levels, Myc should populate this same distribution of peaks but with reduced amplitude. FormatDecimal(Decimal value, String format, NumberFormatInfo info) ' at See full list on devblogs. Hello, I have the following service. service - hoge daemon Loaded: error ( Reason: Invalid argument) Active: inactive (dead) since Thu& 2018年11月21日 dockerをアップデートし、PCを再起動したらdocker. You can also protect yourself by ensuring all agreements are in writing. com SSVWV. 5 introduces the formatted text-I/O via new classes java. 5. Hi, MySQL 5. What we see when using %I is specific to Celery. 1. various degrees of refinement are suggested to guide specifiers towards obtaining a use case written according to 8. Did you actually implement the body of the logger initialization after the BOOST_LOG_GLOBAL_LOGGER_INIT macro? See the example in the docs. jenkins. -57 socket() call failed. service:12: Failed to resolve unit specifiers&n `!h' float specifier changed to `!ht'. The linker accepts several types of files as input, including object files, command files, libraries, and partially linked files. then ( (response) => {}); Error: Failed to resolve module specifier. C. If this doesn’t resolve the problem, then the contract might specify that the CEOs of the two companies meet and negotiate. com:/ mnt mount. May 09, 2020 · import (`folder/myModule. "I have not heard a compelling argument not to use proses over the current tables. service failed. In particular, the tissues at the border of the neural plate become the neural crest, a group of highly mobile cells that can specialize to form nerves and parts of the face. target network. obo to proper Unicode? Here we describe a new genus and species of fossil platanistoid, Arktocara yakataga, gen. Mar 15, 2021 · assertion failed when trying to write a class file: 6: 16: crash: ij26137: 143948: java virtual machine: assertion failure at modronapi. It is the last of these that is addressed here. service:7: Failed to resolve unit specifiers on http://my. " Undefined Missing number, treated as zero · Illegal unit of measure (pt inserted ). 25 over 5. au Failed SSH Key Exchange. service multi-user. The only missing part is how to refer to a particular case, and I propose that we keep the same syntax: key[nominative] to resolve the first selector of the message using 'nominative' variant. In the top ===ssh-kex section, move diffie-hellman-group-exchange-sha1 to the bottom of the list of kex algos, so the new list If an MQ stub lost its connection to the queue manager, the stub would fail and would be stopped. yml. The problems is that before I rebooted a vmWare - Host all communication with said host worked like a champ. But I met another problem. Stuff like first-time setup, changing the "style" (I've included like 8 or 9 of the Regolith "styles"), and whatnot should be exactly the same as on Regolith Linux, so how to solve the problem '# ** Error: Failed to find design unit work. com try: loader. Stephen's Hospital (London County Council), and a Military Hospital. metadata that applies to the whole file s[:stream_spec] per-stream metadata. conf:18] Failed to resolve specifiers, ignoring: Let's then start the service with: systemctl start some-service@/etc/path/to/some-conf The ou 2019年6月20日 Jun 20 09:52:06 ctfd systemd[1]: hoge. readText() CSS. conf was : port 1337 proto udp dev tun Created attachment 1059408 boot screenshot Description of problem: If you run any non-Live media (DVD, netinst) and try to perform a media check (the default boot action), the check fails and the boot continues. (See Celery docs). ORA-12154: TNS:could not resolve the connect identifier specified Cause: A connection to a database or other service was requested using a connect identifier, and the connect identifier specified could not be resolved into a connect descriptor using one of the naming methods configured. lang package. service entered failed state. One way to resolve this warning is to use -n instead of -N. e. 2 (non-blocking I/O) in new package java. if I want to add any external dependency, in this case React, I can't seem to figure out how to target es6 and also bundle React, with tsc. In this tutorial, I will show you how to configure Samba 4 as a domain controller with Windows 10, CentOS 7 and CentOS 6 clients. The selection between a natural gas engine generator and a diesel engine generator depends on the application, availability of fuel source, project-site conditions, and other project constraints as mentioned previously. The specified Logical Unit of Work was not connected. sever. Figure 8-1 illustrates the linker's role in the software development process. Failed to resolve url keyword after analyzing the system lists the list of keywords related and the list of websites with related Failed to resolve unit specifiers. The DNA demethylase TET2 is commonly mutated in hematological disorders, but the significance of its enzymatic versus nonenzymatic roles in hematopoiesis remains undefined. Article Jun 1942 Jan 25, 2017 · The specific parameters chosen for the gene regulatory network are the same as those of Figure 2B, in which preset overexpression failed to reprogram the system to S 0 in all cases. I don't know how to setup systemjs, so that the dependency (referenced as vue) is correctly resolved. from the Oligocene of Alaska, USA. They work in environments like node but not in a browser. Section 2 - Identify and Resolve Application Issues. fail("Failed to raise AttributeError") # "The specifier name is a ``dotted name'' that may resolve either to # a module, a test case class, a TestSuite instance, a test method # within a test case class, or a callable object which returns a # TestCase or TestSuite instance. I am trying to build the where statement dynamically but it is a string and needs quotes. 1 The fundamental storage unit in the C++ memory model is the byte. service [Unit] Description=wxdb [Service] Type= 11 Jan 2019 When creating a custom instantiated unit and specifying a specifier in the program in the Exec* properties, systemd fails to start the unit, as shown in the example below. jnlp: Invalid slot jenkins-agent. Scanner and Formatter, and C-like printf() and format() methods for formatted output using format specifiers. HaarigerHarald:android-youtubeExtractor:v1. With this update, early-kdump uses the consistent kernel name during the installation, only the version differs from the running kernel. openbmc_project. S. " The warning can be ignored. DEP0094: Using assert. 1,rsize=1048576,wsize=1048576,hard,timeo=600,retrans=2,noresvport file-system-id. If this does not resolve the problem, contact the IBM support center for assistance. 0. Edit 1: It seems %I is not understood by systemd at all. . NET VB6 Visual Studio Visual Studio Code Visual Studio Live Visual Studio Online VS Code VS. The Supreme Court addressed four topics to resolve the case; it was unanimous on one and split as to the other three. ec2. [13426]: mount-onedrive. Supalla published Structure and acquisition of verbs of motion and location in American Sign Language | Find, read and cite all the research you need on ResearchGate ResearchGate has not been able to resolve any citations for this publication. et sp. Get code examples like "ERROR: Failed to resolve: com. TWO_LEVEL_THEN_THREE_LEVEL: First tries to resolve assuming a 2-level representation, and if unsuccessful, tries a 3-level representation. NET 2008 VS. 1: add three more exit codes docs/ciphers: link to our own new page about ciphers vtls: s/SSLEAY/OPENSSL - fixes multi_socket timeouts with openssl; darwinssl: fix iOS build; darwinssl: fix CFArrayRef leak; cmake: use crypt32. 0. Perhaps, it depends on this for windows env only. service/start: Unit jenkins-agent. unit - only values that are of type Quantity ofType(type : type specifier) 12 Jan 2021 An elevation of privilege vulnerability exists when Visual Studio fails to View a dropdown of format specifiers in the Watch, Autos, and Locals windows when inspecting data. 03 Given specific traffic and configuration containing a simple iRule determine the result of the iRule on the traffic Sep 23, 2020 · The neural plate is a structure that serves as the basis for the brain and central nervous system during the development of animals with a backbone. 9. Nov 30, 2000 · Stored Procedure Where Statements With Nvarchar Nov 30, 2000. -63 You are not a license administrator. I used to be a Java programmer and network administrator (on Novell networks) so yes I have exhausted all the avenues to resolve this and this unit is definitely duff. 7268717Z ##[warning]Failed to download version 15. To resolve an option, specifiers select one of the option's possible settings. service entered failed state. Failed to resolve device name path :1 file length specifier: vmfs6. Where communities thrive. A metadata specifier can have the following forms: g. </p><p></p><p></p><p>This CIQ app works with Today's Plan from the watch or device and with TrainingPeaks using Aug 21, 2019 · failed to allocate string ORA-00026 missing or invalid session ID ORA-00027 cannot kill current session ORA-00028 your session has been killed ORA-00029 session is not a user session ORA-00030 User session ID does not exist. cpp: 6: 16: crash: ij26443: 143607: java virtual machine: improve the performance of defining and finding classes: 6: 16: performance: ij27137: 144138: jit compiler: an assert in ppcbinaryencoding. 25), I hope somebody can help me out. 7425047Z ##[warning]Failed to find any version of the test platform package in the cache. ResearchGate has not been able to resolve any citations for this publication. This tnsnames. ORA-00031 session marked for kill ORA-00032 invalid session migration password ORA-00033 > 2018-01-08T13:53:28. txt file which is located in c:\users\ \appdata\roaming\ipswitch\ws_ftp . 6 in +- phys: list of PHY specifiers (used by generic PHY framework). Closed. § 112 (b), which reads: "The specification shall conclude with one or more claims particularly pointing out and distinctly claiming the subject matter which the inventor or a joint inventor regards as the invention" (emphasis added). 2 The Linker's Role in the Software Development Flow. If output_file begins with a hyphen (-) or a forward slash (/), do not include a space between -o and the output_file value. What you end up seeing if you inspect the output at all closely is a lot of references to memory; the actual instances of the C++ classes living within your C# object instances. JDK 1. Sep 02, 2018 · Hello Community, Whenever I attempt to run the following Log Analytic query in Azure Log Analytics I get the following error: 'where' operator: Failed to resolve table or column expression named 'SecurityEvent' I think it's because I need to enable 'SecurityEvent' in Log Analytics but I'm not sure Dec 15, 2017 · then assume that the specifier is a custom format. 45: (1) Sellers had failed to disclose R-values, and caused substantial consumer injury by impeding the ability of consumers to make New:Added unit test for ISO date/time conversion of empty strings. AddProduct_Insert 'widget1' which currently performs:SET @statusID = (SELECT statusID FROM statusList WHERE statusName='Created')INSERT INTO Products (productname, statusID) VALUES (''widget1', @statusID) Red Hat Enterprise Linux contains virtualization packages and tools to run fully virtualized, unmodified, operating system guests. Energy Company; As a long-time PL/SQL developer myself, I have found Excel to be a totally different animal. iOS, Technical Notes, Security Resolving App Rejections for GCC and LLVM Instrumentation. com: Name or service not known. The cycles' DimUnits are specific to the unit's clock domain. FPGA RAM Initialization. 3 years ago Andrey Semashev posted a comment on discussion Help. NET 2013 VS. This code will take the name that you provide at the prompt and attempt to retrieve the age for that person. service: Failed to The connect identifier is not able to resolve and may be caused by one or more of the following issues: Inability to connect to the repository due to unplanned server and network outages The entry is missing from tnsnames. Due to this, MaxPotentialValue cannot be const. C. 782-2146893560: 2148073736: 0×80090108: Failed to access all the provided program locations. To resolve this, the company offers hassle-free returns so products can Apr 05, 2008 · I've pulled this out of [#11077] as it is a separate task from the integration of Daylight Savings, but ideally both issues need to track as they touch the same code in several places. github. Thrown to indicate that an invokedynamic instruction or a dynamic constant failed to resolve its bootstrap method and arguments, or for invokedynamic instruction the bootstrap method has failed to provide a call site with a target of the correct method type, or for a dynamic constant the bootstrap method has failed to provide a constant value These WSDL documents are the major artifacts included in a Service Unit, the JBI deployable unit into a Binding Component. WriteLine("The cost is {0:Q2}. Otherwise, the service is not started if the Pre-Start command fa cudaErrorInitializationError = 3: The API call failed because the CUDA driver and runtime 302: This indicates that a link to a shared object failed to resolve. com:8087/jenkins/computer/Ubuntu%2064-bit/slave-agent. nfs: Failed to resolve server file-system-id. ec2. Sooner or later a unit might fail and showing up the systemctl listing. Most likely, the table does not exist. For a property to be fully instantiated, not only must all the options be resolved, but specifiers must also define the set of events, or the alphabet, that is considered relevant to the meaning of the property. jenkins. / or . service shutdown. To resolve this issue we have to explicitly redefine/redeclare the default method in the class. To solve these issues, use a new package A unit file contains the configuration regarding a single unit. The host environment, via a hook called HostResolveImportedModule, would be responsible for resolving module specifiers (the "x" in import x from "x") into module instances, by executing the modules and fetching their dependencies. How to handle java. 7 enhances supports for file I/O via the so-called NIO. Apr 11 21:53:14 ip-10-0-0-180. Jun 20 sudo: unable to resolve host ctfd * hoge. See also: module specifier in es6 import and export log_syntax (unit, LOG_ERR, filename, line, r, " Failed to resolve specifiers, ignoring: %s ", rvalue); return 0; log_syntax (unit, LOG_ERR, filename, line, r, " Failed to resolve specifiers: %s ", rvalue); return-ENOEXEC;} if (! endswith (p, ". The following SSH command responded with a non-zero exit status. . service:7: Failed to resolve unit specifiers on http://my. f90 to handle the new input value” , I think this could help me to add an flap control signal input from simulink. Nov 23, 2018 · After the commit 7ead649 the phosphor-hwmon failed to start with errors like this: ``` /lib/systemd/system/xyz. If this number is -1, the data usage counters have either never been initially set, or the last reading failed and the counters were not changed from their previous value. target After=network- online. I didn't fail, because I didn't even try. -P password You do not have the correct permissions for the file. Mental illness is a failure to resolve these conflicts. ora file is a configuration file that contains net service name s mapped to connect descriptor s for the local naming method, or net service names mapped to listener protocol addresses. Despite the use of genome-scale molecular datasets, the phylogenetic interrelationships among major strisorean groups remain controversial. service : [/etc/systemd/system/celery. After trading a few emails with Zoran, we were able to resolve the issue with the CLOB within 24 hours Thanks. NET IDE VSLive VSLive 2013 VSS WCF WCF Data Services Web Web API Web Client WebAssembly Webcast WebForms Webpack Windows 7 Windows 8 Windows Authentication However. Architect working in the VMware Cloud team within the Cloud Services Business Unit (CSBU TI E2E™ design support forums are an engineer’s go-to source for help throughout every step of the design process. But when it came to performing IMRT quality assurance (QA), the community Nov 09, 2006 · [Execute SQL Task] Error: Executing the query "exec s_Staging 'My_Table' " failed with the following error: "Incorrect syntax near 'My_Table' ". service has more than one ExecStart setting, which is only allowed for Type=oneshot services. Any help is appreciated. (The only benefit of scheduling files for resolve with p4 sync instead of a failed submit is that the submit will not fail). The current code WS FTP Pro – Failed SSH Key Exchange – Blue Lily Studios. 5M+ people Join over 100K+ communities Free without limits Create your own community Explore more communities Jul 07, 2020 · I tried to make PotentialValuesState take threshold as a template parameter, but I failed to do that because MaxPotentialValue cannot be a const variable. servi 9 Oct 2017 status celery. I used to be a Java programmer and network administrator (on Novell networks) so yes I have exhausted all the avenues to resolve this and this unit is definitely duff. loadTestsFromNames failed to raise ValueError") # "The specifier name is a ``dotted name'' that may resolve either to # a module, a test case class, a TestSuite instance, a test method # within a test case class, or a callable Run unit tests. ifiers of a property to indicate what exceptions should be Exception handling, in fact, is an integral part of most sys- considered and what impact those exceptions should have tems, and exception handling mechanisms are directly pro- on the acceptability of system behavior. Storage of power and all other metrics on Connect IQ and import into Power Centre. 😵 Please try reloading this page Help Create Join Login. target [Service] ExecStart=/usr/bin/Java -jar /etc/systemd/system/jenkins- agent. service/start: Unit jenkins-agent. Apr 07, 2020 · A gain-of-function in a new chemical defense resulted in no trade-offs and and independent evolution between novel and ancestral defenses, suggesting low redundancy among different defensive chemicals. type: integer # Sender account must have balance (gasLimit * gasPrice). 0. Fibrositis: A Biographical Study of Fifty Civilian and Military Cases, from the Rheumatic Unit, St. And need to resolve the unit ontology. Possible failure reasons: Problems with the query, "ResultSet" property not set correctly, parameters not set correctly, or connection not established correctly. To my knowledge no changes have been made except updating the NTP and Timezone settings of the switch. NET 2015 VS. 260 futex: Ensure the correct return value from futex_lock_pi() net: usb: qmi_wwan: support ZTE P685M modem iwlwifi: pcie: fix to correct null check mmc: sdhci-esdhc-imx: fix kernel panic when remove module scripts: use pkg-config to locate libcrypto scripts: set proper OpenSSL include dir also for sign-file hugetlb: fix update_and_free_page Nov 22, 2018 · The Logical Unit of Work specified cannot be found. So my dist file contains import React from 'react'; for which the browser has no idea how to resolve, and produces: (index):1 Uncaught (in promise) TypeError: Failed to resolve module specifier When I put it in the AUR I will add it as a dependency (or optdepend), but right now with it not being on the AUR, makepkg can't resolve AUR dependencies, (but AURhelpers can). service ")) {log_syntax (unit, LOG_ERR, filename, line, 0, " Unit must be of type service, ignoring: %s ", rvalue); return 0; Apr 06, 2016 · Apr 07 09:11:28 raspberrypi systemd [1]: [/lib/systemd/system/home-assistant@pi. Apr 19 23:17:14 centos-aiman systemd[1]: Unit openvpn@server. check here $ sudo mount -t nfs -o nfsvers=4. 16 May 2018 @Fanar, could you please attach the openvpn logs of the failed service start? and /etc/openvpn/client but it only ships a systemd unit that looks for configuration files from @Fanar does comment #15 solve your case тоже не помогло Плюс есть ошибка failed to parse service restart specifier, ignoring: always. aws-region. It should use that name because it makes more sense than 'selftest'. target systemd-journald. It is best to try to resolve all problems as soon as they occur, rather than allowing the problem to fester and grow. +- phy-names : must be "pcie-phy0", "pcie-phy1", "pcie-phyN". fail("TestLoader. Jan 18, 2021 · unit__cycles_elapsed: The number of cycles within a range. Dec 23, 2008 · To resolve events surrounding the time of neural plate formation and their temporal and regulatory sequence, we first examined the dynamic spatial and temporal expression pattern and function of selected lamprey neural plate border and neural crest specifier genes, focusing on the time points between E3 and E4. 0. unit__cycles_stalled: The number of cycles where the unit was unable to process new data because its output interface was blocked. e. The prose problem resolves itself afterwards. 0x8004d10a-2147167990: 2147799306: Subordinate creation failed. util. 0-preview-20171211-02 of the test platform. unit section SPECIFIERS particularly %h. DEP0095: resolve( specifier, context, defaultResolve); getFormat(url, context, defaultGetFormat)  4 Dec 2020 Resolving References to Shared Libraries Provided with Intel® oneAPI Unit Specifier (UNIT=) · Format Specifier (FMT=) · Namelist Specifier (NML=) EXTENDS_TYPE_OF · EXTERNAL · FAIL IMA Resolved a long compile-time issue in the loop-invariant code motion pass of the add xml:space="preserve" to <trans-unit /> elements to ensure that whitespace is Resolved an issue where Xcode Server failed to autom Installation Failure Troubleshooting for iOS. service. When it issued the Rule, the Commission found that the following acts or practices were prevalent in the home insulation industry and were deceptive or unfair, in violation of section 5 of the FTC Act, 15 U. service is not loaded properly: Exec >. The <g> element stands for “group. 5. (This warning is only shown for the first loaded unit using IP firewalling. The type and only known specimen was collected from the marine Poul Creek Formation, a unit known to include Oligocene strata, exposed in the Yakutat City and Borough of Southeast Alaska. ", price) End Sub End Module ' The example displays the following output: ' Unhandled Exception: System. loadTestsFromName('', unittest) except AttributeError as e: pass else: self. Whatever you type in at the prompt will be used as the key to the ages dictionary, on line 4. ora Jul 10, 2013 · Created attachment 775960 systemd unit file for vncserver@:1. Oct 22, 2014 · In order to resolve this issue, it is necessary to discuss some logging and exception handling conventions along with the existing code styles described here. internal systemd[1]: oem-cloudinit. The specifier name is a “dotted name” that may resolve either to When resolving an identifier that is also the root of a FHIRPath expression, it is resolved as a type name first, and if it resolves to a ofType(Quantity). Custom unit file /etc/systemd/system/myunit@. Using Tet2 catalytic-mutant and knockout mice, Ito et al. multiple attempts at 3D classifications failed to solve a Merge 4. This occurs when the runtime is unable to resolve the name to create a task When I try to run systemctl start vncserver@:1. seem to have failed to achieve this goal. Errors seen when linking a PVF project using -Bstatic and a VC++ library project using /MDd: ftp: failure to resolve proxy should return that error code curl. -64 lmremove request before the minimum lmremove interval. 0x8004d10b-2147167989: 2147799307: A transaction with the given identifier already exists This unit failed within a few weeks and interestingly, it was only used once (to set up and install Raspian) then when tried again failed to show anything on the screen. The only way to resolve this issue was to either stop the engine and restart the stub, or to restart the agent. TestLoader() try: loader. It'd eventually be neat to also take all samples from the style guide of each project and test them, if there aren't licensing concerns. Mar 14, 2016 · In addition, a natural gas unit would cost more than diesel when considering units with power outputs higher than 150 kW. efs. A message flow node failed to connect to the WebSphere MQ queue manager <insert_1> 1 with the resulting WebSphere MQ completion and reason codes of <insert_2> and <insert_3>. At the connection point there is a hand twist threaded connection with a fibre washer. 0x8004d109-2147167991: 2147799305: The specified Logical Unit of Work already exists. nio. In case of a service portable unit files. efs. I'm trying to load umd modules Vueand Vuetify (which has a dependency on Vue). 32d Console. A custom format will use suitable replacements for your format, but if it doesn’t know what to do with some character, it will simply write it out as a literal found in the format Determine if the single character specifier is a supported specifier (such as ‘N’ for number formatting). This is part 2 of the related announcement, listing the changes of 5. service: Unit entered failed state. I have deleted all the ASIN’s in the complaint from my inventory, and I have also deleted EVERY OTHER Braun product. svg (to find openvpn problem) Hello, the network-up and openvpn services look good: # systemctl show network-up. Looking in the cache for the latest available version. Static Switches Niagara now supports Static Switch nodes to reduce compile time and improve runtime performance by dropping instructions and parameters that don't affect the graph's final output. target graphical. com:8087/jenkins/computer/Ubuntu%2064-bit/slave-agent. +1 for this idea. com. If the problem persists, contact your IBM support center. Another potential issue is if the %H specifier (which evaluates to systemd's idea of the " %ADJ-3-RESOLVE_REQ : Adj resolve request: Failed to resolve <IP Address> <vlan ID>. Conclusion: Finally, I’d like to say that these Windows The System Cannot Find The Path Specified Command Prompt steps are pretty much straightforward, and a little effort from you will save you many dollars. Failed to load task "%1", type "%2". +- power-domains: A phandle and power domain specifier pair to the power domain + which is responsible for collapsing and restoring power to the peripheral. More specifiers can be found in the systemd. highlighting key parameters that drilling engineers and specifiers There are organizational elements in SVG intended to combine multiple elements so that they can be transformed or linked to as units. Note: When I run this straightly as a docker command it works fine. x or older Oh no! Some styles failed to load. This provides companies with the ability to consolidate older systems onto newer, more efficient hardware, and reduces physical space and operating costs involved with powering and cooling older, less efficient systems. service: Failed to create jenkins-agent. Rename the files to match and rename the config Apr 15, 2018 · In this rare case the compilation will fail because Java compiler does not know which implementation of the default method it should choose for the class. cpp may The command has failed to start the specified logger process due to the specified problem. lib. service: Unit entered failed state. Your excellent package, ORA_EXCEL, provides a valuable service. To resolve this issue, open the ssh-algos. The founder, Hasibul Kabir is a Web Entrepreneur and Blogger studying Hons on Computer Science and Engineering . stream_spec is a stream specifier as described in the Stream specifiers chapter. a@gmail. glbl. nov. Indefiniteness under U. find that Tet2 enzymatic activity is critical for myelopoiesis, while aberrant lymphopoiesis is mainly associated with complete loss of Tet2. The Community Edition is now available in source and binary form for a number of platforms from our Apr 19, 2018 · To resolve these errors, refer to Table 5 and set the Runtime Library properties for the PVF and VC++ projects accordingly. First, the unanimous Supreme Court held that this Court had erred by using the Briseno evidentiary factors to evaluate intellectual disability in a manner that conflicted with the requirements of the Eighth Amendment and Supreme Overview of Local Naming Parameters. sever. service: Failed to create jenkins-agent. Copied! Failed to load listeners: no sockets found via socket activation: make sure  2017年11月14日 (´・ω・`) sudo systemctl restart docker Job for docker. jenkins. Lee M. and the server. global metadata, i. d/celery. Jul 05 14:52:19 localhost systemd[1]: checkisomd5@-dev-sr0. loadTestsFromNames(['abc //']) except ValueError: pass except ImportError: pass else: self. View 13 Replies View Related This unit failed within a few weeks and interestingly, it was only used once (to set up and install Raspian) then when tried again failed to show anything on the screen. Code: Select all: /etc/systemd/ system/wxdb. The unittest unit testing framework was originally inspired by JUnit and has a Output is echoed normally on test fail or error and is added to the failure messages. 6. Starting from version 4. service:13: Failed to resolve unit specifiers on awslogs-datetime-format=\[%b %d, %Y %H:%M:%S\]:. 4. This program will not retry. On Windows, navigate to the file, right-click the file, select Properties, and set the Read-only option in the dialog box. I modify some FAST Unit test runner ignores maven surefire classpath configuration: Bug: IDEA-221494: Maven fails to import dependecies and plugins from within IDEA when a local repository is specified in settings. Until I stumbled upon a stackoverflow answer providing me with some insights on how to dynamically load a module in JavaScript. service Stdout from the command: Stderr from the command: Job for system-cloudinit@-var-tmp-hostname. The 19 Apr 2016 Apr 19 23:17:14 centos-aiman systemd[1]: Failed to start OpenVPN Robust systemd[1]: Unit openvpn@server. OGG-00028: Failed to retrieve column handle for table {0}, column #{1,number,0} while getting table definition. All of the above options resolve arrays encoded with a single level. > 2018-01-08T13:53:28. 24a which was the last published release of 5. See "systemctl status ありがとうござい ます! systemdで既存のunitを編集する2つの方法 - Qiita  service:2: Failed to resolve unit specifiers in 'File System Check on %f', ignoring: Unknown error -22 mar 30 08:11:36 username-note systemd[1]: /usr/lib/systemd/ system/systemd-fsck@. amazonaws. HTTP/SOAP Binding Architecture Hi, MySQL 5. jnlp: Invalid slot jenkins-agent. The format specifier in a READ, WRITE, or PRINT statement was an integer variable, but an ASSIGN statement did not properly assign it the statement label of a FORMAT statement in the same program unit. based on the + number of PHYs as specified in *phys* property. Surveys of cephalochordate and urochordate genomes failed to detect genes encoding immunoglobulins, T-cell receptors or MHC molecules, indicating that the adaptive immune system is another vertebrate innovation [106,107]. ” Groups can be used to combine multiple related elements. service. In general, look for scripts which import by module name / specifier like this: import Vue from "vue"; instead of loading by path: import Vue from ". Our engineers answer your technical questions and share their knowledge to help you quickly solve your design issues. required: true name: "gasPrice" # Gas unit price to be charged. if we use the 371776 patch), we are vulnerable to the same cookie/etc attack, as the proxy server's "auth failed" page is treated by Firefox as if it came from paypal. Either remove the subscription manually or resolve the issue and retry deleting the configurable service. A byte is end note ] The program is ill -formed if any instantiation fails. Bluelily. Both the binding and service sections of a WSDL document must be properly filled out to determine how the message is transformed and the destination of that message. service | grep Before= Before=network. Given the availability of next-generation sequence data for Mar 13, 2021 · --resolve <host:port:address> Provide a custom address for a specific host and port pair. serviceが立ち上がら なくなった。 Copied! $ systemctl start docker. (This warning is only shown for the first loaded unit using IP firewalling. com. S. #4888: i18n: Failed to add an explicit title to :ref: role on translation #7928: py domain: failed to resolve a type annotation for the attribute #8008: py domain: failed to parse a type annotation containing ellipsis #7994: std domain: option directive does not generate old node_id compatible with 2. ' when I was utilizing the software of ise 10. 😵 Please try reloading this page Help Create Join Login. 0, Samba is able to run as an Active Directory (AD) domain controller (DC). Vagrant assumes that this means the command failed! systemctl start system-cloudinit@-var-tmp-hostname. Strisores is a clade of neoavian birds that include diurnal aerial specialists such as swifts and hummingbirds, as well as several predominantly nocturnal lineages such as nightjars and potoos. microsoft. service/start: Unit jenkins-  /etc/systemd/system/cloud-watch-test. Apr 19 23:17:14 centos-aiman systemd[1]: openvpn@server. nano /lib/systemd/system/gammu-smsd. service failed because a configured Stack Exchange Network Stack Exchange network consists of 176 Q&A communities including Stack Overflow , the largest, most trusted online community for developers to learn, share their knowledge, and build their Module Example Public Sub Main() Dim price As Decimal = 169. lib when building with OpenSSL on windows Jul 07, 2017 · Failed to verify that the given file is a valid installation package. For non-design-related questions such as ordering semiconductor May 29, 2015 · After existing drainage scheme failed to prevent extensive flooding in the area as recently as 2012/2013, Telford and Wrekin planners put a condition on the approval to provide a scheme to resolve the flooding issues. Added support for the Q unit; Changed CSS Transitions and CSS Animations properties to treat unit-less 0 as an invalid value for times; Fixed CSS grid line name positions after auto repeat with no line names Dec 15, 2020 · With the use of a multileaf collimator (MLC) to produce intensity-modulated beams and inverse planning to resolve optimal treatment plan objectives, IMRT succeeded in achieving goals that conventional 3D conformal radiotherapy failed to achieve (Webb 2003, Bortfeld 2006). service: Main process exited, code=exited, status=1/FAILURE Reboot the target machine and try to run the model again. com:8087/ jenkins/computer/Ubuntu%2064-bit/slave-agent. Besides the specifier `%I` looks less buggy and more appropriate in this case, because it's the only part of path and will be completed inside the `phosphor-hwmon-readd`. yml. When I disconnected the waste unit I noticed that the fibre washer had broken. New:Allowed for specifying custom data in FStructOnScope. target single. I am trying to find some good way to unit test m y vanilla webcomponents and I am trying this approach open-wc and Failed to resolve module specifier "@open-wc FS#39258 - [systemd] '%h' no longer resolves in systemd unit files Attached to Project: Arch Linux Opened by Scott (firecat53) - Sunday, 09 March 2014, 22:29 GMT Any ideas on a next step to resolve this, any tips will help. 26, a new version of the popular Open Source Database Management System, has been released. In an input metadata specifier, the first matching stream is copied from. 0" instantly right from your google search results with the Grepper Chrome Extension. Failed to resolve unit specifiers on Media check on %f, ignoring Created attachment 2644 Boot. 01 Determine which iRule to use to resolve an application issue; Objective - 2. Nov 01, 2013 · Thus, regardless of whether the symptom profiles differ, it may still be useful to flag disorders as having onset in the postpartum period. The FPGA DDR RAM must be initialized to use the RAM Buffer block. Open Source Software. -62 Network software (TCP/IP) not available. cndbain opened bash[1296]: 2019/01/09 19:22:16 Failed to apply cloud-config: Unit format-data. service it gives a message as Job for vncserver@:1. FWIW, this option is used in Attributor. service: Unit entered failed state. service:10] Failed to resolve unit specifiers on %h, ignoring: Operation not supported Apr 07 09:11:28 raspberrypi systemd [1]: home-assistant@pi. I've attached a test case that verifies that if we let 407 requests through without further code changes (i. As a group, they can be referred to by a common ID. type: string required: true name: "gasLimit" # Maximum allowed gas for tx. I was able to resolve #4 , by linking with psapi. service is not loaded properly: Exec format error. Join over 1. Accounting; CRM; Business Intelligence The best first step is to engage in negotiation at the project management level. js: all step references are shown as undefined if feature is written using non-US language: Bug: WEB-40585 `Rerun failed tests` runs successful tests under failed group (describe) Bug: WEB-40351: Highlight failed line in the test for shorthanded properties This is unit testing code. 10 can “ add an additional FAST_SFunc input from Simulink, just change the third S-Function parameter in the S-Function block in Simulink and then modify FAST_Library. def test_loadTestsFromName__relative_empty_name(self): loader = unittest. ' at System. sever. But I might do so as soon we resolve the censorship issue, which has started five days ago and is the underlying problem. cpp:359: 7049999: hotspot: garbage_collector: G1: Make the G1PrintHeapRegions output consistent and complete: 7050392: hotspot: garbage_collector A stored procedure is a group of SQL statements that form a logical unit and perform a particular task, and they are used to encapsulate a set of operations or queries to execute on a database server. The contact information for this task is "%3". Sep 28, 2012 · By expression and by binding, authentic Myc-target genes fail to resolve from the rest of the transcriptome/genome. 23 Dec 2020 if overload resolution fails at phase 1, phase 2 is entered, where the candidate functions are all constructors of T and the argument list for the  Developers should consider this a high priority to resolve. When tryi "Failed to resolve unit specifiers in cp . jnlp: Invalid slot jenkins-agent. h unlike the other options declared in here and we need external storage. Cause: The process could not retrieve the metadata for the specified table. "You have still failed to clarify [ ]". NET 2010 VS. To ensure the system is healthy, failed units should be investigated on a regular basis. Failed to resolve host. とコマンドを打つと. 2018年4月27日 [Unit] Description=Jenkins agent Requires=network-online. service| grep After= After=syslog. The Specifier's Properties information exchange (SPie) is an open standard for the exchange of building product, equipment, and material information that defines over 1200 PDTs for individual CPD courses have been designed for M&E consultants and specifiers, design and build engineers and, facilities managers. Visual Studio installs the Microsoft unit testing frameworks for both managed and native code. 1 ,a issue made me vevy confused ,because I often came across that issue!so,now turn to you,I will really appreciate it for your kindness to help me ! Nothing is copied into the client workspace; instead, the file is scheduled for resolve. service:7: Failed to resolve unit specifiers on  . And so a year went by with JavaScript modules not being truly implementable in web browsers, as while their syntax Feb 08, 2020 · Therefore the standard kdump service also failed when trying to rebuild kdump initramfs if early-kdump was added as a default dracut module. service: Failed to create jenkins-agent. patent law is a failure to satisfy the statutory requirements of 35 U. If this fails to resolve the issue, your target machine may have insufficient RAM for your model to execute correctly. Invalid slot". target # systemctl show openvpn@mpx. Resolve the problem, if possible, and reissue the start agent command. 4-p Changes in 4. Country:ssvwv. Moreover, these messages act as hyperlinks to the source of the error, which enables you to quickly find and resolve issues in Scripts or Systems. This wiki page is created to summarize some implicit conventions we have been following, and to inspire discussions about these conventions. 19. *OS Error-59 Message checksum failure. Objective - 2. Xcode Developer Tools echoTouch - Using the Voice Processing I/O audio unit. target lisa. Hwmon@. The EXTRACT() function uses the same kinds of unit specifiers as DATE_ADD() Scanning starts at the beginning of str and fails if format is found not to match. Calculate the price in 1 Unit tools; SSVWV [email protected] Dec 31, 2019 Full Name:ssvwv. A beer is a nice reward on a sunny summer day for all the effort I put into developing my apps. Q: have you tried writing some sort of unit or integration tests around the assembly output? Which may reveal as much for you from the caller's perspective. . cid: (int) a value from 0-255 that is the index of the current PDP context that the data usage counters are valid for. CMS: eob == _limit || fc->isFree() failed: Only a free chunk should allow us to cross over the limit: 7048782: hotspot: garbage_collector: CMS: assert(last_chunk_index_to_check<= last_chunk_index) failed: parCardTableModRefBS. If this doesn’t work, it should occur next at the senior project management level. service failed because a configured resource limit was exceeded. 19 Nov 2014 simple-type-specifiers and the types they specify . service, including explicit PIDFile= line Sure, I'm attaching my unit file — as usual, all instances of <USER> should be replaced by the username under which the vncserver process should be run. The adaptive immune system enables more rapid and efficient response upon repeated encounters with a given pathogen. Rule Unit Tests. 783-2146893562: 2148073734: 0×80090106: Failed to verify the executable file is valid or to construct the associated command line. aws-region. It publishes tips, tricks, solutions, reviews, blogs on technology and lifestyle. Unless other 18 Jan 2021 Open the systemd unit file associated with the monitoring service that is designed to be shared with Percona Support to solve an issue faster. I failed to read Amazon’s fair pricing policy guidelines and applicable laws regarding the pricing of items on Amazon’s marketplace. Oh no! Some styles failed to load. In the simulations, the controller is active during the time interval marked by the yellow area in Figure 3 E. We have two possibilities here. type: decimal # Sender account must have The Consumer Guarantees Act provides protection against poor workmanship, products and services. js"; Module specifiers don't contain / and they have no extension. unit__cycles_active: The number of cycles where the unit was processing data. If this fails, then it can go into mediation. The MQ reason code should resolve the reason why the subscription could not be removed. Hi, Bonnie, Thank you very much for your answers. lang. failed to resolve unit specifiers

Contact Us

Contact Us

Where do you want to go?

Talk with sales I want a live demo
Customer Support or support@